Thread Rating:
  • 0 Vote(s) - 0 Average
  • 1
  • 2
  • 3
  • 4
  • 5
Project crashing MusE when loading
#16
unfortunately that didn't work. It wouldn't build. Here's the output.

ser@ChrUbuntu:~/muse_source/muse2$ ./compile_muse.sh
Create build dir
-- The C compiler identification is GNU
-- The CXX compiler identification is GNU
-- Check for working C compiler: /usr/bin/gcc
-- Check for working C compiler: /usr/bin/gcc -- works
-- Detecting C compiler ABI info
-- Detecting C compiler ABI info - done
-- Check for working CXX compiler: /usr/bin/c++
-- Check for working CXX compiler: /usr/bin/c++ -- works
-- Detecting CXX compiler ABI info
-- Detecting CXX compiler ABI info - done
vst header path: /home/user/muse_source/muse2/vestige
-- Found Git: /usr/bin/git
Unix (probably linux) found
-- Looking for Q_WS_X11
-- Looking for Q_WS_X11 - found
-- Looking for Q_WS_WIN
-- Looking for Q_WS_WIN - not found.
-- Looking for Q_WS_QWS
-- Looking for Q_WS_QWS - not found.
-- Looking for Q_WS_MAC
-- Looking for Q_WS_MAC - not found.
-- Found Qt4: /usr/bin/qmake (found suitable version "4.8.1", required is "4.3.0")
-- Looking for ladspa.h
-- Looking for ladspa.h - found
-- checking for module 'alsa>=0.9.0'
-- found alsa, version 1.0.25
-- checking for module 'sndfile>=1.0.0'
-- found sndfile, version 1.0.25
-- checking for module 'samplerate>=0.1.0'
-- found samplerate, version 0.1.8
-- checking for module 'uuid>=0.0.1'
-- found uuid, version 2.20.0
-- checking for module 'jack>=0.103'
-- found jack, version 0.121.2
-- checking for module 'lash-1.0>=0.2'
-- package 'lash-1.0>=0.2' not found
-- checking for module 'liblo>=0.23'
-- package 'liblo>=0.23' not found
-- checking for module 'dssi>=0.9.0'
-- found dssi, version 1.1.1
Native VST support enabled
-- checking for module 'fluidsynth>=0.9.0'
-- found fluidsynth, version 1.1.5


** WARNING: lash (>= 0.2) was enabled, but development files were not found.
** HINT: Don't have LASH? Try installing the LADISH LASH compatibility package instead.
** WARNING: liblo (>= 0.23) (Lightweight Open Sound Control) was enabled, but development files were not found.


The following components will be built:
-----------------------------------------------
DSSI support
Native VST support
Fluidsynth support

The following components WILL NOT be built:
-----------------------------------------------
Lash support
OSC (Liblo) support
Python support
Experimental features

Internal modules will be built as shared components.
Build type: release

-- Configuring done
-- Generating done
-- Build files have been written to: /home/user/muse_source/muse2/build
[ 0%] Generating ../all.h
Scanning dependencies of target al
[ 0%] Building CXX object al/CMakeFiles/al.dir/al.o
[ 0%] Building CXX object al/CMakeFiles/al.dir/dsp.o
[ 0%] Building CXX object al/CMakeFiles/al.dir/sig.o
[ 0%] Building CXX object al/CMakeFiles/al.dir/xml.o
Linking CXX shared library libmuse_al.so
[ 0%] Built target al
[ 0%] Generating moc_volslider.cxx
[ 0%] Generating moc_aslider.cxx
[ 1%] Generating moc_checkbox.cxx
[ 1%] Generating moc_combobox.cxx
[ 1%] Generating moc_drawbar.cxx
[ 1%] Generating moc_floatentry.cxx
[ 1%] Generating moc_knob.cxx
[ 1%] Generating moc_midimeter.cxx
[ 1%] Generating moc_midimslider.cxx
[ 2%] Generating moc_midipanentry.cxx
[ 2%] Generating moc_midipanknob.cxx
[ 2%] Generating moc_midivolentry.cxx
[ 2%] Generating moc_mslider.cxx
[ 2%] Generating moc_panentry.cxx
[ 2%] Generating moc_panknob.cxx
[ 2%] Generating moc_pitchedit.cxx
[ 3%] Generating moc_pitchlabel.cxx
[ 3%] Generating moc_posedit.cxx
[ 3%] Generating moc_sigedit.cxx
[ 3%] Generating moc_sigspinbox.cxx
[ 3%] Generating moc_slider.cxx
[ 3%] Generating moc_tempoedit.cxx
[ 3%] Generating moc_tempolabel.cxx
[ 4%] Generating moc_volentry.cxx
[ 4%] Generating moc_volknob.cxx
Scanning dependencies of target awl
[ 5%] Building CXX object awl/CMakeFiles/awl.dir/aslider.o
[ 5%] Building CXX object awl/CMakeFiles/awl.dir/awl.o
[ 5%] Building CXX object awl/CMakeFiles/awl.dir/checkbox.o
[ 5%] Building CXX object awl/CMakeFiles/awl.dir/combobox.o
[ 5%] Building CXX object awl/CMakeFiles/awl.dir/drawbar.o
[ 5%] Building CXX object awl/CMakeFiles/awl.dir/floatentry.o
[ 6%] Building CXX object awl/CMakeFiles/awl.dir/knob.o
[ 6%] Building CXX object awl/CMakeFiles/awl.dir/midimeter.o
[ 6%] Building CXX object awl/CMakeFiles/awl.dir/midimslider.o
[ 6%] Building CXX object awl/CMakeFiles/awl.dir/midipanentry.o
[ 6%] Building CXX object awl/CMakeFiles/awl.dir/midipanknob.o
[ 6%] Building CXX object awl/CMakeFiles/awl.dir/midivolentry.o
[ 6%] Building CXX object awl/CMakeFiles/awl.dir/mslider.o
[ 7%] Building CXX object awl/CMakeFiles/awl.dir/panentry.o
[ 7%] Building CXX object awl/CMakeFiles/awl.dir/panknob.o
[ 7%] Building CXX object awl/CMakeFiles/awl.dir/pitchedit.o
[ 7%] Building CXX object awl/CMakeFiles/awl.dir/pitchlabel.o
[ 7%] Building CXX object awl/CMakeFiles/awl.dir/posedit.o
[ 7%] Building CXX object awl/CMakeFiles/awl.dir/sigedit.o
[ 7%] Building CXX object awl/CMakeFiles/awl.dir/sigspinbox.o
[ 8%] Building CXX object awl/CMakeFiles/awl.dir/slider.o
[ 8%] Building CXX object awl/CMakeFiles/awl.dir/tempoedit.o
[ 8%] Building CXX object awl/CMakeFiles/awl.dir/tempolabel.o
[ 8%] Building CXX object awl/CMakeFiles/awl.dir/utils.o
[ 8%] Building CXX object awl/CMakeFiles/awl.dir/volentry.o
[ 8%] Building CXX object awl/CMakeFiles/awl.dir/volknob.o
[ 8%] Building CXX object awl/CMakeFiles/awl.dir/volslider.o
[ 9%] Building CXX object awl/CMakeFiles/awl.dir/moc_aslider.o
[ 9%] Building CXX object awl/CMakeFiles/awl.dir/moc_checkbox.o
[ 9%] Building CXX object awl/CMakeFiles/awl.dir/moc_combobox.o
[ 9%] Building CXX object awl/CMakeFiles/awl.dir/moc_drawbar.o
[ 9%] Building CXX object awl/CMakeFiles/awl.dir/moc_floatentry.o
[ 9%] Building CXX object awl/CMakeFiles/awl.dir/moc_knob.o
[ 10%] Building CXX object awl/CMakeFiles/awl.dir/moc_midimeter.o
[ 10%] Building CXX object awl/CMakeFiles/awl.dir/moc_midimslider.o
[ 10%] Building CXX object awl/CMakeFiles/awl.dir/moc_midipanentry.o
[ 10%] Building CXX object awl/CMakeFiles/awl.dir/moc_midipanknob.o
[ 10%] Building CXX object awl/CMakeFiles/awl.dir/moc_midivolentry.o
[ 10%] Building CXX object awl/CMakeFiles/awl.dir/moc_mslider.o
[ 10%] Building CXX object awl/CMakeFiles/awl.dir/moc_panentry.o
[ 11%] Building CXX object awl/CMakeFiles/awl.dir/moc_panknob.o
[ 11%] Building CXX object awl/CMakeFiles/awl.dir/moc_pitchedit.o
[ 11%] Building CXX object awl/CMakeFiles/awl.dir/moc_pitchlabel.o
[ 11%] Building CXX object awl/CMakeFiles/awl.dir/moc_posedit.o
[ 11%] Building CXX object awl/CMakeFiles/awl.dir/moc_sigedit.o
[ 11%] Building CXX object awl/CMakeFiles/awl.dir/moc_sigspinbox.o
[ 11%] Building CXX object awl/CMakeFiles/awl.dir/moc_slider.o
[ 12%] Building CXX object awl/CMakeFiles/awl.dir/moc_tempoedit.o
[ 12%] Building CXX object awl/CMakeFiles/awl.dir/moc_tempolabel.o
[ 12%] Building CXX object awl/CMakeFiles/awl.dir/moc_volentry.o
[ 12%] Building CXX object awl/CMakeFiles/awl.dir/moc_volknob.o
[ 12%] Building CXX object awl/CMakeFiles/awl.dir/moc_volslider.o
Linking CXX shared library libmuse_awl.so
[ 12%] Built target awl
Scanning dependencies of target grepmidi
[ 12%] Building CXX object grepmidi/CMakeFiles/grepmidi.dir/grepmidi.o
/home/user/muse_source/muse2/grepmidi/grepmidi.cpp: In function ‘int grep(FILE*)’:
/home/user/muse_source/muse2/grepmidi/grepmidi.cpp:261:26: warning: ignoring return value of ‘size_t fread(void*, size_t, size_t, FILE*)’, declared with attribute warn_unused_result [-Wunused-result]
/home/user/muse_source/muse2/grepmidi/grepmidi.cpp: In function ‘int grepTrack(FILE*, int)’:
/home/user/muse_source/muse2/grepmidi/grepmidi.cpp:134:26: warning: ignoring return value of ‘size_t fread(void*, size_t, size_t, FILE*)’, declared with attribute warn_unused_result [-Wunused-result]
Linking CXX executable grepmidi
[ 12%] Built target grepmidi
[ 12%] Generating ../../all-pic.h
Scanning dependencies of target synti
[ 12%] Building CXX object synti/libsynti/CMakeFiles/synti.dir/mess.o
[ 12%] Building CXX object synti/libsynti/CMakeFiles/synti.dir/gui.o
/home/user/muse_source/muse2/synti/libsynti/gui.cpp: In member function ‘void MessGui::writeEvent(const MusECore::MidiPlayEvent&)’:
/home/user/muse_source/muse2/synti/libsynti/gui.cpp:130:29: warning: ignoring return value of ‘ssize_t write(int, const void*, size_t)’, declared with attribute warn_unused_result [-Wunused-result]
/home/user/muse_source/muse2/synti/libsynti/gui.cpp: In member function ‘void MessGui::readMessage()’:
/home/user/muse_source/muse2/synti/libsynti/gui.cpp:70:34: warning: ignoring return value of ‘ssize_t read(int, void*, size_t)’, declared with attribute warn_unused_result [-Wunused-result]
[ 12%] Building CXX object synti/libsynti/CMakeFiles/synti.dir/mono.o
[ 12%] Building CXX object synti/libsynti/CMakeFiles/synti.dir/poly.o
Linking CXX shared library libmuse_synti.so
[ 12%] Built target synti
Scanning dependencies of target icons
[ 12%] Building CXX object muse/CMakeFiles/icons.dir/icons.o
Linking CXX shared library libmuse_icons.so
[ 12%] Built target icons
[ 12%] Generating ui_editinstrumentbase.h
[ 12%] Generating moc_editinstrument.cxx
Scanning dependencies of target instruments
[ 12%] Building CXX object muse/instruments/CMakeFiles/instruments.dir/editinstrument.o
In file included from /home/user/muse_source/muse2/muse/track.h:39:0,
from /home/user/muse_source/muse2/muse/song.h:39,
from /home/user/muse_source/muse2/muse/instruments/editinstrument.cpp:45:
/home/user/muse_source/muse2/muse/ctrl.h:34:29: fatal error: lo/lo_osc_types.h: No such file or directory
compilation terminated.
make[2]: *** [muse/instruments/CMakeFiles/instruments.dir/editinstrument.o] Error 1
make[1]: *** [muse/instruments/CMakeFiles/instruments.dir/all] Error 2
make: *** [all] Error 2
user@ChrUbuntu:~/muse_source/muse2$ cd build
user@ChrUbuntu:~/muse_source/muse2/build$ sudo make install
[ 0%] Built target al
[ 12%] Built target awl
[ 12%] Built target grepmidi
[ 12%] Built target synti
[ 12%] Built target icons
[ 12%] Building CXX object muse/instruments/CMakeFiles/instruments.dir/editinstrument.o
In file included from /home/user/muse_source/muse2/muse/track.h:39:0,
from /home/user/muse_source/muse2/muse/song.h:39,
from /home/user/muse_source/muse2/muse/instruments/editinstrument.cpp:45:
/home/user/muse_source/muse2/muse/ctrl.h:34:29: fatal error: lo/lo_osc_types.h: No such file or directory
compilation terminated.
make[2]: *** [muse/instruments/CMakeFiles/instruments.dir/editinstrument.o] Error 1
make[1]: *** [muse/instruments/CMakeFiles/instruments.dir/all] Error 2
make: *** [all] Error 2
Reply


Messages In This Thread
Re: Project crashing MusE when loading - by d-sweaters - 12-31-2013, 01:25 AM

Forum Jump:


Users browsing this thread: 1 Guest(s)