Thread Rating:
  • 1 Vote(s) - 5 Average
  • 1
  • 2
  • 3
  • 4
  • 5
Problem building muse
#1
Hi, i'm trying to build muse 2.1 on an amd64 and the log i get from cmake is the following:

Quote:[ 0%] Built target al
[ 12%] Built target awl
[ 12%] Built target grepmidi
[ 12%] Built target icons
[ 13%] Built target instruments
[ 52%] Built target widgets
[ 52%] Built target cliplist
[ 58%] Built target widgets_functiondialogs
[ 59%] Built target remote
[ 60%] Built target synti
[ 61%] Built target marker
[ 62%] Built target liste
[ 64%] Built target master
[ 68%] Built target mixer
[ 70%] Built target arranger
[ 71%] Built target waveedit
[ 73%] Built target ctrl
[ 75%] Built target mplugins
[ 75%] Building CXX object muse/driver/CMakeFiles/driver.dir/jack.o
/home/map/sources/muse-2.1rc2/muse/driver/jack.cpp:59:17: fatal error: fst.h: No such file or directory
compilation terminated.
make[2]: *** [muse/driver/CMakeFiles/driver.dir/jack.o] Error 1
make[1]: *** [muse/driver/CMakeFiles/driver.dir/all] Error 2
make: *** [all] Error 2
so any ideas or help about what could be the cause i would be really thankfull. I have jackd2 installed so i don't know what could be the problem. Thanks in advance
Reply


Messages In This Thread
Problem building muse - by chechenia007 - 12-21-2012, 10:47 PM
Re: Problem building muse - by term356 - 12-31-2012, 05:17 AM

Forum Jump:


Users browsing this thread: 1 Guest(s)