Thread Rating:
  • 1 Vote(s) - 5 Average
  • 1
  • 2
  • 3
  • 4
  • 5
Problem building Muse2.0 for Slackware [Solved]
#1
Hello,

Afer I installed muse2.0 in several distros, I am trying bulding Muse2.0 in a Slackware64 current multilibs, and I get this error :

Code:
Scanning dependencies of target arranger
[ 53%] Building CXX object muse/arranger/CMakeFiles/arranger.dir/alayout.o
[ 54%] Building CXX object muse/arranger/CMakeFiles/arranger.dir/arranger.o
[ 54%] Building CXX object muse/arranger/CMakeFiles/arranger.dir/arrangerview.o
[ 54%] Building CXX object muse/arranger/CMakeFiles/arranger.dir/pcanvas.o
[ 54%] Building CXX object muse/arranger/CMakeFiles/arranger.dir/tlist.o
/home/jbeziat/muse-2.0/muse/arranger/tlist.cpp: In member function 'virtual void MusEGui::TList::mousePressEvent(QMouseEvent*)':
/home/jbeziat/muse-2.0/muse/arranger/tlist.cpp:1746:80: error: invalid use of incomplete type 'class MusECore::Pipeline'
In file included from /home/jbeziat/muse-2.0/muse/track.h:36:0,
                 from /home/jbeziat/muse-2.0/muse/arranger/tlist.h:26,
                 from /home/jbeziat/muse-2.0/muse/arranger/tlist.cpp:45:
/home/jbeziat/muse-2.0/muse/node.h:100:7: error: forward declaration of 'class MusECore::Pipeline'
make[2]: *** [muse/arranger/CMakeFiles/arranger.dir/tlist.o] Error 1
make[1]: *** [muse/arranger/CMakeFiles/arranger.dir/all] Error 2
make: *** [all] Error 2
I had installed Muse2.0rc2 without problem, and I don't understand what's wrong now...?

An idea ?
Reply


Messages In This Thread
Problem building Muse2.0 for Slackware [Solved] - by paradise74 - 08-23-2012, 12:18 AM

Forum Jump:


Users browsing this thread: 1 Guest(s)